- Feed Queries
- All Stories
- Search
- Feed Search
- Transactions
- Transaction Logs
Feed Search
Sep 15 2024
Sep 15 2024
dmbaturin added a project to T2231: commit(-confirm) with illegal config does not stop the commit: Bugs.
dmbaturin added a project to T4025: OpenVPN server with TAP interface, client didn’t see network: Bugs.
Sep 15 2024, 5:04 PM · Bugs, VyOS 1.5 Circinus, VyOS 1.4 Sagitta (1.4.1), Restricted Project, openvpn
dmbaturin added a project to T5737: Eigrp #11301 - Configuration failed error type: validation: Bugs.
dmbaturin added a project to T5744: PKI import OpenVPN shared key includes unexpected BEGIN and END: Bugs.
dmbaturin added a project to T5675: 'show configuration all' is no different from 'show configuration': Bugs.
dmbaturin added a project to T5797: MSS Clamping Not Applied to VRF Interface from MPLS Cloud: Bugs.
dmbaturin added a project to T6042: ssh scripts should work with arguments again; they do not anymore: Bugs.
dmbaturin added a project to T6223: The number of symbols for iproute2 kernel interface name is limited: Bugs.
dmbaturin added a project to T6233: Container configurations on VyOS 1.5 prevent containers from starting: Bugs.
dmbaturin added a project to T6302: The root task for bugs and improvements related to commit time and boot: Bugs.
dmbaturin added a project to T6322: Include microcode update packages for both Intel and AMD64 cpus: Bugs.
dmbaturin added a project to T6439: QoS: Filtering on Mark broken between 1.4.0-epa2 and 1.4.0-epa3: Bugs.
dmbaturin added a project to T6516: ISIS - advertise-passive-only not install route in the RIB: Bugs.
dmbaturin added a project to T6578: Unhandled exception in "show openconnect-server sessions": Bugs.
dmbaturin added a project to T6639: Resolve undesired interactions configverify <-> configfs <-> configd: Bugs.
dmbaturin added a project to T6675: VXLAN Interface configuration lost due to improper bridge detachment: Bugs.
dmbaturin added a project to T5356: DMVPN NHRP spoke stops sending resolution requests upon restart: Bugs.
dmbaturin added a project to T6667: Problems with simultaneous usage of multiple `vtysh` processes: Bugs.
dmbaturin added a project to T6704: [vyos-1x] unlimited _noteworthy in vyos.airbag cause memory leak: Bugs.
dmbaturin added a project to T6647: Zone-based Firewalls on Bridges would flag related DHCP traffic invalid: Bugs.
c-po lowered the priority of T6715: date: manually changing time/date is not synced into hardware clock from Normal to Low.
c-po changed the status of T6715: date: manually changing time/date is not synced into hardware clock from Open to In progress.
Sep 14 2024
Sep 14 2024
c-po moved T6653: Generate a build/manifest.json file after assembling the image(s) from Backlog to Finished on the VyOS 1.4 Sagitta (1.4.1) board.
c-po moved T6702: Podman 4.9.5 is missing "podman.sock" service socket from Backlog to Finished on the VyOS 1.4 Sagitta (1.4.1) board.
Sep 13 2024
Sep 13 2024
Viacheslav changed the status of T6674: Add build packages without Jenkins, a subtask of T6529: Jenkins Build System Deprecation, from Open to In progress.
Viacheslav changed the status of T6674: Add build packages without Jenkins from Open to In progress.
Viacheslav reopened T6674: Add build packages without Jenkins, a subtask of T6529: Jenkins Build System Deprecation, as Open.
Restricted Repository Identity closed T6674: Add build packages without Jenkins, a subtask of T6529: Jenkins Build System Deprecation, as Resolved.
Restricted Repository Identity closed T6674: Add build packages without Jenkins as Resolved by committing rVYOSONEX4667eefa033e: Merge pull request #4066 from sever-sever/T6674-trigger-fix.
jestabro changed the status of T6007: Improvements to migration system, a subtask of T6302: The root task for bugs and improvements related to commit time and boot, from Unknown Status to Resolved.
jestabro changed the status of T6007: Improvements to migration system from Unknown Status to Resolved.
jestabro closed T6710: Migration scripts fails for the circinus, a subtask of T6007: Improvements to migration system, as Resolved.
Unfortunately the version: v2.18.1 (2024/05/20) does not work correctly and previous versions 2.17.1 are not compatible with the newest kernel version
make -C /vyos/work/T6713-current-realtek/vyos-build/packages/linux-kernel/linux M=/vyos/work/T6713-current-realtek/vyos-build/packages/linux-kernel/vyos-drivers-realtek-r8152-2.17.1 modules
make[2]: Entering directory '/vyos/work/T6713-current-realtek/vyos-build/packages/linux-kernel/linux-6.6.49'
CC [M] /vyos/work/T6713-current-realtek/vyos-build/packages/linux-kernel/vyos-drivers-realtek-r8152-2.17.1/r8152.o
/vyos/work/T6713-current-realtek/vyos-build/packages/linux-kernel/vyos-drivers-realtek-r8152-2.17.1/r8152.c: In function ‘r8152_csum_workaround’:
/vyos/work/T6713-current-realtek/vyos-build/packages/linux-kernel/vyos-drivers-realtek-r8152-2.17.1/r8152.c:2114:24: error: implicit declaration of function ‘skb_gso_segment’; did you mean ‘skb_gso_reset’? [-Werror=implicit-function-declaration]
2114 | segs = skb_gso_segment(skb, features);
| ^~~~~~~~~~~~~~~
| skb_gso_reset
/vyos/work/T6713-current-realtek/vyos-build/packages/linux-kernel/vyos-drivers-realtek-r8152-2.17.1/r8152.c:2114:22: warning: assignment to ‘struct sk_buff *’ from ‘int’ makes pointer from integer without a cast [-Wint-conversion]
2114 | segs = skb_gso_segment(skb, features);
| ^
cc1: some warnings being treated as errors
make[4]: *** [scripts/Makefile.build:243: /vyos/work/T6713-current-realtek/vyos-build/packages/linux-kernel/vyos-drivers-realtek-r8152-2.17.1/r8152.o] Error 1
make[3]: *** [/vyos/work/T6713-current-realtek/vyos-build/packages/linux-kernel/linux-6.6.49/Makefile:1921: /vyos/work/T6713-current-realtek/vyos-build/packages/linux-kernel/vyos-drivers-realtek-r8152-2.17.1] Error 2
make[2]: *** [Makefile:234: __sub-make] Error 2
make[2]: Leaving directory '/vyos/work/T6713-current-realtek/vyos-build/packages/linux-kernel/linux-6.6.49'
make[1]: *** [debian/rules:23: override_dh_auto_build] Error 2
make[1]: Leaving directory '/vyos/work/T6713-current-realtek/vyos-build/packages/linux-kernel/vyos-drivers-realtek-r8152-2.17.1'
make: *** [debian/rules:9: binary] Error 2
dpkg-buildpackage: error: debian/rules binary subprocess returned exit status 2
debuild: fatal error at line 1182:
dpkg-buildpackage -us -uc -ui failed
Traceback (most recent call last):
File "/vyos/work/T6713-current-realtek/vyos-build/packages/linux-kernel/./build-driver-realtek-r8152.py", line 88, in <module>
run(debuild_cmd, cwd=PACKAGE_DIR, check=True)
File "/usr/lib/python3.11/subprocess.py", line 571, in run
raise CalledProcessError(retcode, process.args,
subprocess.CalledProcessError: Command '['debuild']' returned non-zero exit status 29.natali-rs1985 moved T6181: A feature for checking popular ports. from Open to In Progress on the VyOS 1.5 Circinus board.
natali-rs1985 moved T6676: Invalid route-map caused bgpd to crash from Open to Finished on the VyOS 1.5 Circinus board.
Sep 12 2024
Sep 12 2024