- Feed Queries
- All Stories
- Search
- Feed Search
- Transactions
- Transaction Logs
Sep 15 2024
Sep 14 2024
Sep 13 2024
Unfortunately the version: v2.18.1 (2024/05/20) does not work correctly and previous versions 2.17.1 are not compatible with the newest kernel version
make -C /vyos/work/T6713-current-realtek/vyos-build/packages/linux-kernel/linux M=/vyos/work/T6713-current-realtek/vyos-build/packages/linux-kernel/vyos-drivers-realtek-r8152-2.17.1 modules
make[2]: Entering directory '/vyos/work/T6713-current-realtek/vyos-build/packages/linux-kernel/linux-6.6.49'
CC [M] /vyos/work/T6713-current-realtek/vyos-build/packages/linux-kernel/vyos-drivers-realtek-r8152-2.17.1/r8152.o
/vyos/work/T6713-current-realtek/vyos-build/packages/linux-kernel/vyos-drivers-realtek-r8152-2.17.1/r8152.c: In function ‘r8152_csum_workaround’:
/vyos/work/T6713-current-realtek/vyos-build/packages/linux-kernel/vyos-drivers-realtek-r8152-2.17.1/r8152.c:2114:24: error: implicit declaration of function ‘skb_gso_segment’; did you mean ‘skb_gso_reset’? [-Werror=implicit-function-declaration]
2114 | segs = skb_gso_segment(skb, features);
| ^~~~~~~~~~~~~~~
| skb_gso_reset
/vyos/work/T6713-current-realtek/vyos-build/packages/linux-kernel/vyos-drivers-realtek-r8152-2.17.1/r8152.c:2114:22: warning: assignment to ‘struct sk_buff *’ from ‘int’ makes pointer from integer without a cast [-Wint-conversion]
2114 | segs = skb_gso_segment(skb, features);
| ^
cc1: some warnings being treated as errors
make[4]: *** [scripts/Makefile.build:243: /vyos/work/T6713-current-realtek/vyos-build/packages/linux-kernel/vyos-drivers-realtek-r8152-2.17.1/r8152.o] Error 1
make[3]: *** [/vyos/work/T6713-current-realtek/vyos-build/packages/linux-kernel/linux-6.6.49/Makefile:1921: /vyos/work/T6713-current-realtek/vyos-build/packages/linux-kernel/vyos-drivers-realtek-r8152-2.17.1] Error 2
make[2]: *** [Makefile:234: __sub-make] Error 2
make[2]: Leaving directory '/vyos/work/T6713-current-realtek/vyos-build/packages/linux-kernel/linux-6.6.49'
make[1]: *** [debian/rules:23: override_dh_auto_build] Error 2
make[1]: Leaving directory '/vyos/work/T6713-current-realtek/vyos-build/packages/linux-kernel/vyos-drivers-realtek-r8152-2.17.1'
make: *** [debian/rules:9: binary] Error 2
dpkg-buildpackage: error: debian/rules binary subprocess returned exit status 2
debuild: fatal error at line 1182:
dpkg-buildpackage -us -uc -ui failed
Traceback (most recent call last):
File "/vyos/work/T6713-current-realtek/vyos-build/packages/linux-kernel/./build-driver-realtek-r8152.py", line 88, in <module>
run(debuild_cmd, cwd=PACKAGE_DIR, check=True)
File "/usr/lib/python3.11/subprocess.py", line 571, in run
raise CalledProcessError(retcode, process.args,
subprocess.CalledProcessError: Command '['debuild']' returned non-zero exit status 29.Sep 12 2024
Sep 10 2024
Sep 9 2024
Sep 6 2024
Sep 4 2024
This bug should be closed since vyos has moved to use Kea and no longer uses wide-dhcpv6
Sep 2 2024
Just upgrade from 1.3 LTS to 1.5-rolling-202408300023 on XCP-ng 8.2 with latest patches.
The sg offload setting seems fixed the drop packet issue.
set interfaces ethernet eth0 offload sg set interfaces ethernet eth1 offload sg ...
Sep 1 2024
Aug 27 2024
Aug 26 2024
Aug 25 2024
Aug 24 2024
Aug 23 2024
The following simple commit will need to be backported to sagitta so that a PR for the above will backport cleanly:
https://github.com/vyos/vyos-1x/pull/4013
PR to follow smoketests and cosmetic changes:
https://github.com/vyos/vyos-1x/compare/current...jestabro:configdep-prio
Aug 22 2024
Aug 21 2024
A few immediate notes, before preparing the solution:
(1) this is independent of whether one is running under configd or not
(2) this is more easily triggered under 1.4/1.5, which has default ['system', 'conntrack', 'modules'] entries (fixed in current), though can be reproduced in current with the above and 'set ... conntrack modules ..'
(3) this was avoided in 1.4.0 by the global dependency pruning; that raised other serious issues, however (T6559), due to constraints of the legacy commit algorithm.
Aug 19 2024
Aug 17 2024
Aug 16 2024
@natali-rs1985 thanks for testing!
Aug 15 2024
Aug 14 2024
Aug 13 2024
Aug 12 2024
Might be related patches (no idea if they have anything to do with the kernel panics seen in 6.6):
Aug 10 2024
Aug 9 2024
Second issue, above, is T6642.
Aug 5 2024
@marekm Create please the PR to the correct repo https://github.com/accel-ppp/accel-ppp
It looks good.